{"text_format":"1","workbook":"xlsx","n_sheets":2,"sheets":["PORTFOLIO","calculations"],"not_rendered":{"charts":3,"images":0,"macros":0,"external_links":0,"defined_names":15,"comments":0,"pivot_tables":0},"unopened":[],"bounds":{"document_bytes":16777216,"sheet_cells":100000,"rows_first":2000,"rows_last":500,"rows_between":2000,"halvings":0,"cell_chars":16384,"cell_head_chars":4096},"cells_cut":0,"cells_raw":0,"read":"whole","date_system":"1900"}

{"sheet":"PORTFOLIO","index":0,"n_rows":29,"n_cols":12,"rows_kept":29,"cut":false,"hidden":false,"merged":[]}
[]
[null,"MY PORTFOLIO",null,{"$f":"TotalTitle","v":"Total Value of Portfolio: $49,654.10 "}]
[]
[]
[]
[]
[]
[]
[]
[]
[]
[]
[]
[]
[]
[null,"Symbol","Company Name","Current Price","Change in Price","% Change in Price","Quantity","Total","Sector","Industry","Type","Open"]
[null,"MSFT","Microsoft Corporation",28.15,0.2,7.1999999999999998E-3,179,{"$f":"Table1[[#This Row],[Quantity]]*Table1[[#This Row],[Current Price]]","v":5038.8499999999995},"Technology","Software - Infrastructure","Equity",27.82]
[null,"LNCO","Linn Co",38.520000000000003,-0.26,-6.7000000000000002E-3,225,{"$f":"Table1[[#This Row],[Quantity]]*Table1[[#This Row],[Current Price]]","v":8667},"Energy","Oil & Gas E&P","Equity",38.799999999999997]
[null,"F","Ford Motor Co",12.75,0.14000000000000001,1.11E-2,141,{"$f":"Table1[[#This Row],[Quantity]]*Table1[[#This Row],[Current Price]]","v":1797.75},"Consumer Cyclical","Auto Manufacturers","Equity",12.55]
[null,"BGSC","BGS Acquisition Corp",9.94,-0.02,-2E-3,86,{"$f":"Table1[[#This Row],[Quantity]]*Table1[[#This Row],[Current Price]]","v":854.83999999999992},"Industrials","Conglomerates","Equity",9.93]
[null,"ADRD","BLDRS Developed Markets 100 ADR Index F",21.46,0.08,3.8999999999999998E-3,300,{"$f":"Table1[[#This Row],[Quantity]]*Table1[[#This Row],[Current Price]]","v":6438},"Consumer Defensive","Packaged Foods","Fund",21.45]
[null,"V","Visa",159.5,1.42,8.9999999999999993E-3,97,{"$f":"Table1[[#This Row],[Quantity]]*Table1[[#This Row],[Current Price]]","v":15471.5},"Financial Services","Credit Services","Equity",157.76]
[null,"MGI","MoneyGram International Inc",17.27,0.7,4.2200000000000001E-2,34,{"$f":"Table1[[#This Row],[Quantity]]*Table1[[#This Row],[Current Price]]","v":587.17999999999995},"Industrials","Business Services","Equity",16.47]
[null,"R","Ryder System Inc",55.58,0.15,2.7000000000000001E-3,45,{"$f":"Table1[[#This Row],[Quantity]]*Table1[[#This Row],[Current Price]]","v":2501.1},"Industrials","Rental & Leasing Services","Equity",55.15]
[null,"JACK","Jack In The Box Inc",31.79,-0.26,-8.0999999999999996E-3,54,{"$f":"Table1[[#This Row],[Quantity]]*Table1[[#This Row],[Current Price]]","v":1716.6599999999999},"Consumer Cyclical","Restaurants","Equity",31.97]
[null,"GE","General Electric Co",23.27,0.08,3.3999999999999998E-3,36,{"$f":"Table1[[#This Row],[Quantity]]*Table1[[#This Row],[Current Price]]","v":837.72},"Industrials","Diversified Industrials","Equity",23.15]
[null,"SBUX","Starbucks Corporation",55.7,0.83,1.5100000000000001E-2,100,{"$f":"Table1[[#This Row],[Quantity]]*Table1[[#This Row],[Current Price]]","v":5570},"Consumer Cyclical","Restaurants","Equity",54.77]
[null,"NOK","Nokia Corp ADS",3.47,-0.12,-3.3399999999999999E-2,50,{"$f":"Table1[[#This Row],[Quantity]]*Table1[[#This Row],[Current Price]]","v":173.5},"Technology","Communication Equipment","Equity",3.48]
[null,"TOTAL",null,null,null,null,null,{"$f":"SUBTOTAL(109,Table1[Total])","v":49654.100000000006}]

{"sheet":"calculations","index":1,"n_rows":156,"n_cols":12,"rows_kept":156,"cut":false,"hidden":true,"merged":[]}
["This sheet should remain hidden. Any changes made to this sheet could result in errors in the Bing Portfolio"]
[]
[]
[]
[]
[null,"Category Plot:",{"$f":"ChartOptionTitle","v":"Portfolio Sectors"}]
[]
[]
[null,null,{"$f":"INDEX(PORTFOLIO!$I$16:$I$137, MATCH(0, COUNTIF($C$8:C8, PORTFOLIO!$I$16:$I$137), 0))","v":"Sector"},{"$f":"COUNT(IF(LEN(D10:D19)>0,1))","v":7}]
[null,{"$f":"IFERROR(IF(C10=0,\"\",C10),\"\")","v":"Technology"},{"$f":"INDEX(PORTFOLIO!$I$16:$I$137, MATCH(0, COUNTIF($C$8:C9, PORTFOLIO!$I$16:$I$137), 0))","v":"Technology"},{"$f":"IFERROR(IF(C10=0,\"Other\",C10),\"\")","v":"Technology"},{"$f":"IF(ISERROR(C10),\"\",SUMIFS(Table1[Total],Table1[Sector],B10))","v":5212.3499999999995}]
[null,"Energy",{"$f":"INDEX(PORTFOLIO!$I$16:$I$137, MATCH(0, COUNTIF($C$8:C10, PORTFOLIO!$I$16:$I$137), 0))","v":"Energy"},"Energy",{"$f":"IF(ISERROR(C11),\"\",SUMIFS(Table1[Total],Table1[Sector],B11))","v":8667}]
[null,"Consumer Cyclical",{"$f":"INDEX(PORTFOLIO!$I$16:$I$137, MATCH(0, COUNTIF($C$8:C11, PORTFOLIO!$I$16:$I$137), 0))","v":"Consumer Cyclical"},"Consumer Cyclical",{"$f":"IF(ISERROR(C12),\"\",SUMIFS(Table1[Total],Table1[Sector],B12))","v":9084.41}]
[null,"Industrials",{"$f":"INDEX(PORTFOLIO!$I$16:$I$137, MATCH(0, COUNTIF($C$8:C12, PORTFOLIO!$I$16:$I$137), 0))","v":"Industrials"},"Industrials",{"$f":"IF(ISERROR(C13),\"\",SUMIFS(Table1[Total],Table1[Sector],B13))","v":4780.84}]
[null,"Consumer Defensive",{"$f":"INDEX(PORTFOLIO!$I$16:$I$137, MATCH(0, COUNTIF($C$8:C13, PORTFOLIO!$I$16:$I$137), 0))","v":"Consumer Defensive"},"Consumer Defensive",{"$f":"IF(ISERROR(C14),\"\",SUMIFS(Table1[Total],Table1[Sector],B14))","v":6438}]
[null,"Financial Services",{"$f":"INDEX(PORTFOLIO!$I$16:$I$137, MATCH(0, COUNTIF($C$8:C14, PORTFOLIO!$I$16:$I$137), 0))","v":"Financial Services"},"Financial Services",{"$f":"IF(ISERROR(C15),\"\",SUMIFS(Table1[Total],Table1[Sector],B15))","v":15471.5}]
[null,"",{"$f":"INDEX(PORTFOLIO!$I$16:$I$137, MATCH(0, COUNTIF($C$8:C15, PORTFOLIO!$I$16:$I$137), 0))","v":0},"Other",{"$f":"IF(ISERROR(C16),\"\",SUMIFS(Table1[Total],Table1[Sector],B16))","v":0}]
[null,"",{"$f":"INDEX(PORTFOLIO!$I$16:$I$137, MATCH(0, COUNTIF($C$8:C16, PORTFOLIO!$I$16:$I$137), 0))","v":{"$error":"#N/A"}},"",{"$f":"IF(ISERROR(C17),\"\",SUMIFS(Table1[Total],Table1[Sector],B17))","v":""}]
[null,"",{"$f":"INDEX(PORTFOLIO!$I$16:$I$137, MATCH(0, COUNTIF($C$8:C17, PORTFOLIO!$I$16:$I$137), 0))","v":{"$error":"#N/A"}},"",{"$f":"IF(ISERROR(C18),\"\",SUMIFS(Table1[Total],Table1[Sector],B18))","v":""}]
[null,"",{"$f":"INDEX(PORTFOLIO!$I$16:$I$137, MATCH(0, COUNTIF($C$8:C18, PORTFOLIO!$I$16:$I$137), 0))","v":{"$error":"#N/A"}},"",{"$f":"IF(ISERROR(C19),\"\",SUMIFS(Table1[Total],Table1[Sector],B19))","v":""}]
[]
[]
[]
[]
[]
[null,null,{"$f":"INDEX(PORTFOLIO!$J$16:$J$137, MATCH(0, COUNTIF($C$24:C24, PORTFOLIO!$J$16:$J$137), 0))","v":"Industry"},{"$f":"COUNT(IF(LEN(D26:D35)>0,1))","v":10}]
[null,{"$f":"IFERROR(IF(C26=0,\"\",C26),\"\")","v":"Software - Infrastructure"},{"$f":"INDEX(PORTFOLIO!$J$16:$J$137, MATCH(0, COUNTIF($C$24:C25, PORTFOLIO!$J$16:$J$137), 0))","v":"Software - Infrastructure"},{"$f":"IFERROR(IF(C26=0,\"Other\",C26),\"\")","v":"Software - Infrastructure"},{"$f":"IF(ISERROR(C26),\"\",SUMIFS(Table1[Total],Table1[Industry],B26))","v":5038.8499999999995}]
[null,"Oil & Gas E&P",{"$f":"INDEX(PORTFOLIO!$J$16:$J$137, MATCH(0, COUNTIF($C$24:C26, PORTFOLIO!$J$16:$J$137), 0))","v":"Oil & Gas E&P"},"Oil & Gas E&P",{"$f":"IF(ISERROR(C27),\"\",SUMIFS(Table1[Total],Table1[Industry],B27))","v":8667}]
[null,"Auto Manufacturers",{"$f":"INDEX(PORTFOLIO!$J$16:$J$137, MATCH(0, COUNTIF($C$24:C27, PORTFOLIO!$J$16:$J$137), 0))","v":"Auto Manufacturers"},"Auto Manufacturers",{"$f":"IF(ISERROR(C28),\"\",SUMIFS(Table1[Total],Table1[Industry],B28))","v":1797.75}]
[null,"Conglomerates",{"$f":"INDEX(PORTFOLIO!$J$16:$J$137, MATCH(0, COUNTIF($C$24:C28, PORTFOLIO!$J$16:$J$137), 0))","v":"Conglomerates"},"Conglomerates",{"$f":"IF(ISERROR(C29),\"\",SUMIFS(Table1[Total],Table1[Industry],B29))","v":854.83999999999992}]
[null,"Packaged Foods",{"$f":"INDEX(PORTFOLIO!$J$16:$J$137, MATCH(0, COUNTIF($C$24:C29, PORTFOLIO!$J$16:$J$137), 0))","v":"Packaged Foods"},"Packaged Foods",{"$f":"IF(ISERROR(C30),\"\",SUMIFS(Table1[Total],Table1[Industry],B30))","v":6438}]
[null,"Credit Services",{"$f":"INDEX(PORTFOLIO!$J$16:$J$137, MATCH(0, COUNTIF($C$24:C30, PORTFOLIO!$J$16:$J$137), 0))","v":"Credit Services"},"Credit Services",{"$f":"IF(ISERROR(C31),\"\",SUMIFS(Table1[Total],Table1[Industry],B31))","v":15471.5}]
[null,"Business Services",{"$f":"INDEX(PORTFOLIO!$J$16:$J$137, MATCH(0, COUNTIF($C$24:C31, PORTFOLIO!$J$16:$J$137), 0))","v":"Business Services"},"Business Services",{"$f":"IF(ISERROR(C32),\"\",SUMIFS(Table1[Total],Table1[Industry],B32))","v":587.17999999999995}]
[null,"Rental & Leasing Services",{"$f":"INDEX(PORTFOLIO!$J$16:$J$137, MATCH(0, COUNTIF($C$24:C32, PORTFOLIO!$J$16:$J$137), 0))","v":"Rental & Leasing Services"},"Rental & Leasing Services",{"$f":"IF(ISERROR(C33),\"\",SUMIFS(Table1[Total],Table1[Industry],B33))","v":2501.1}]
[null,"Restaurants",{"$f":"INDEX(PORTFOLIO!$J$16:$J$137, MATCH(0, COUNTIF($C$24:C33, PORTFOLIO!$J$16:$J$137), 0))","v":"Restaurants"},"Restaurants",{"$f":"IF(ISERROR(C34),\"\",SUMIFS(Table1[Total],Table1[Industry],B34))","v":7286.66}]
[null,"Diversified Industrials",{"$f":"INDEX(PORTFOLIO!$J$16:$J$137, MATCH(0, COUNTIF($C$24:C34, PORTFOLIO!$J$16:$J$137), 0))","v":"Diversified Industrials"},"Diversified Industrials",{"$f":"IF(ISERROR(C35),\"\",SUMIFS(Table1[Total],Table1[Industry],B35))","v":837.72}]
[]
[]
[]
[]
[]
[null,null,{"$f":"INDEX(PORTFOLIO!$K$16:$K$28, MATCH(0, COUNTIF($C$40:C40, PORTFOLIO!$K$16:$K$137), 0))","v":"Type"},{"$f":"COUNT(IF(LEN(D42:D51)>0,1))","v":2}]
[null,{"$f":"IFERROR(IF(C42=0,\"\",C42),\"\")","v":"Equity"},"Equity",{"$f":"IFERROR(IF(C42=0,\"Other\",C42),\"\")","v":"Equity"},{"$f":"IF(ISERROR(C42),\"\",SUMIFS(Table1[Total],Table1[Type],B42))","v":43216.100000000006}]
[null,"Fund","Fund",{"$f":"IFERROR(IF(C43=0,\"Other\",C43),\"\")","v":"Fund"},{"$f":"IF(ISERROR(C43),\"\",SUMIFS(Table1[Total],Table1[Type],B43))","v":6438}]
[null,"",{"$f":"INDEX(PORTFOLIO!$K$16:$K$137, MATCH(0, COUNTIF($C$40:C43, PORTFOLIO!$K$16:$K$137), 0))","v":0},{"$f":"IFERROR(IF(C44=0,\"\",C44),\"\")","v":""},{"$f":"IF(ISERROR(C44),\"\",SUMIFS(Table1[Total],Table1[Type],B44))","v":0}]
[null,"",{"$f":"INDEX(PORTFOLIO!$K$16:$K$137, MATCH(0, COUNTIF($C$40:C44, PORTFOLIO!$K$16:$K$137), 0))","v":{"$error":"#N/A"}},{"$f":"IFERROR(IF(C45=0,\"Other\",C45),\"\")","v":""},{"$f":"IF(ISERROR(C45),\"\",SUMIFS(Table1[Total],Table1[Type],B45))","v":""}]
[null,"",{"$f":"INDEX(PORTFOLIO!$K$16:$K$137, MATCH(0, COUNTIF($C$40:C45, PORTFOLIO!$K$16:$K$137), 0))","v":{"$error":"#N/A"}},"",{"$f":"IF(ISERROR(C46),\"\",SUMIFS(Table1[Total],Table1[Type],B46))","v":""}]
[null,"",{"$f":"INDEX(PORTFOLIO!$K$16:$K$137, MATCH(0, COUNTIF($C$40:C46, PORTFOLIO!$K$16:$K$137), 0))","v":{"$error":"#N/A"}},"",{"$f":"IF(ISERROR(C47),\"\",SUMIFS(Table1[Total],Table1[Type],B47))","v":""}]
[null,"",{"$f":"INDEX(PORTFOLIO!$K$16:$K$137, MATCH(0, COUNTIF($C$40:C47, PORTFOLIO!$K$16:$K$137), 0))","v":{"$error":"#N/A"}},"",{"$f":"IF(ISERROR(C48),\"\",SUMIFS(Table1[Total],Table1[Type],B48))","v":""}]
[null,"",{"$f":"INDEX(PORTFOLIO!$K$16:$K$137, MATCH(0, COUNTIF($C$40:C48, PORTFOLIO!$K$16:$K$137), 0))","v":{"$error":"#N/A"}},"",{"$f":"IF(ISERROR(C49),\"\",SUMIFS(Table1[Total],Table1[Type],B49))","v":""}]
[null,"",{"$f":"INDEX(PORTFOLIO!$K$16:$K$137, MATCH(0, COUNTIF($C$40:C49, PORTFOLIO!$K$16:$K$137), 0))","v":{"$error":"#N/A"}},"",{"$f":"IF(ISERROR(C50),\"\",SUMIFS(Table1[Total],Table1[Type],B50))","v":""}]
[null,"",{"$f":"INDEX(PORTFOLIO!$K$16:$K$137, MATCH(0, COUNTIF($C$40:C50, PORTFOLIO!$K$16:$K$137), 0))","v":{"$error":"#N/A"}},"",{"$f":"IF(ISERROR(C51),\"\",SUMIFS(Table1[Total],Table1[Type],B51))","v":""}]
[]
[]
[null,null,null,null,null,null,null,{"$f":"IF(COUNT(IF(LEN(H57:H156)>0,1))<11,H56,\"Top 10 of \" & COUNT(IF(LEN(H57:H156)>0,1))) & \" Positions\"","v":"Top 10 of 12 Positions"}]
[]
[null,null,null,null,null,null,null,{"$f":"MIN(COUNT(IF(LEN(H57:H156)>0,1)),10)","v":10}]
[null,null,null,null,null,1,{"$f":"INDEX(PORTFOLIO!$B$17:$B$215,$F57)","v":"MSFT"},{"$f":"REPT(G57,(G57<>\"total\")*(G57<>0))&REPT(\"No Positions\",G57=0)","v":"MSFT"},{"$f":"IF((G57<>\"total\")*(G57<>0),INDEX(PORTFOLIO!$H$17:$H$215,$F57),0)","v":5038.8499999999995},{"$f":"LARGE($I$57:$I$156,ROWS($J$57:$J57))","v":15471.5},{"$f":"MATCH(J57,$I$57:$I$156,0)","v":6},{"$f":"INDEX($H$57:$H$156,K57)","v":"V"}]
[null,null,null,null,null,2,{"$f":"INDEX(PORTFOLIO!$B$17:$B$215,$F58)","v":"LNCO"},{"$f":"REPT(G58,(G58<>\"total\")*(G58<>0))","v":"LNCO"},{"$f":"IF((G58<>\"total\")*(G58<>0),INDEX(PORTFOLIO!$H$17:$H$215,$F58),0)","v":8667},{"$f":"LARGE($I$57:$I$156,ROWS($J$57:$J58))","v":8667},{"$f":"MATCH(J58,$I$57:$I$156,0)","v":2},{"$f":"INDEX($H$57:$H$156,K58)","v":"LNCO"}]
[null,null,null,null,null,3,{"$f":"INDEX(PORTFOLIO!$B$17:$B$215,$F59)","v":"F"},"F",{"$f":"IF((G59<>\"total\")*(G59<>0),INDEX(PORTFOLIO!$H$17:$H$215,$F59),0)","v":1797.75},{"$f":"LARGE($I$57:$I$156,ROWS($J$57:$J59))","v":6438},5,"ADRD"]
[null,null,null,null,null,4,{"$f":"INDEX(PORTFOLIO!$B$17:$B$215,$F60)","v":"BGSC"},"BGSC",{"$f":"IF((G60<>\"total\")*(G60<>0),INDEX(PORTFOLIO!$H$17:$H$215,$F60),0)","v":854.83999999999992},{"$f":"LARGE($I$57:$I$156,ROWS($J$57:$J60))","v":5570},11,"SBUX"]
[null,null,null,null,null,5,{"$f":"INDEX(PORTFOLIO!$B$17:$B$215,$F61)","v":"ADRD"},"ADRD",{"$f":"IF((G61<>\"total\")*(G61<>0),INDEX(PORTFOLIO!$H$17:$H$215,$F61),0)","v":6438},{"$f":"LARGE($I$57:$I$156,ROWS($J$57:$J61))","v":5038.8499999999995},1,"MSFT"]
[null,null,null,null,null,6,{"$f":"INDEX(PORTFOLIO!$B$17:$B$215,$F62)","v":"V"},"V",{"$f":"IF((G62<>\"total\")*(G62<>0),INDEX(PORTFOLIO!$H$17:$H$215,$F62),0)","v":15471.5},{"$f":"LARGE($I$57:$I$156,ROWS($J$57:$J62))","v":2501.1},8,"R"]
[null,null,null,null,null,7,{"$f":"INDEX(PORTFOLIO!$B$17:$B$215,$F63)","v":"MGI"},"MGI",{"$f":"IF((G63<>\"total\")*(G63<>0),INDEX(PORTFOLIO!$H$17:$H$215,$F63),0)","v":587.17999999999995},{"$f":"LARGE($I$57:$I$156,ROWS($J$57:$J63))","v":1797.75},3,"F"]
[null,null,null,null,null,8,{"$f":"INDEX(PORTFOLIO!$B$17:$B$215,$F64)","v":"R"},"R",{"$f":"IF((G64<>\"total\")*(G64<>0),INDEX(PORTFOLIO!$H$17:$H$215,$F64),0)","v":2501.1},{"$f":"LARGE($I$57:$I$156,ROWS($J$57:$J64))","v":1716.6599999999999},9,"JACK"]
[null,null,null,null,null,9,{"$f":"INDEX(PORTFOLIO!$B$17:$B$215,$F65)","v":"JACK"},"JACK",{"$f":"IF((G65<>\"total\")*(G65<>0),INDEX(PORTFOLIO!$H$17:$H$215,$F65),0)","v":1716.6599999999999},{"$f":"LARGE($I$57:$I$156,ROWS($J$57:$J65))","v":854.83999999999992},4,"BGSC"]
[null,null,null,null,null,10,{"$f":"INDEX(PORTFOLIO!$B$17:$B$215,$F66)","v":"GE"},"GE",{"$f":"IF((G66<>\"total\")*(G66<>0),INDEX(PORTFOLIO!$H$17:$H$215,$F66),0)","v":837.72},{"$f":"LARGE($I$57:$I$156,ROWS($J$57:$J66))","v":837.72},10,"GE"]
[null,null,null,null,null,11,{"$f":"INDEX(PORTFOLIO!$B$17:$B$215,$F67)","v":"SBUX"},"SBUX",{"$f":"IF((G67<>\"total\")*(G67<>0),INDEX(PORTFOLIO!$H$17:$H$215,$F67),0)","v":5570},{"$f":"LARGE($I$57:$I$156,ROWS($J$57:$J67))","v":587.17999999999995},7,"MGI"]
[null,null,null,null,null,12,{"$f":"INDEX(PORTFOLIO!$B$17:$B$215,$F68)","v":"NOK"},"NOK",{"$f":"IF((G68<>\"total\")*(G68<>0),INDEX(PORTFOLIO!$H$17:$H$215,$F68),0)","v":173.5},{"$f":"LARGE($I$57:$I$156,ROWS($J$57:$J68))","v":173.5},12,"NOK"]
[null,null,null,null,null,13,{"$f":"INDEX(PORTFOLIO!$B$17:$B$215,$F69)","v":"TOTAL"},"",{"$f":"IF((G69<>\"total\")*(G69<>0),INDEX(PORTFOLIO!$H$17:$H$215,$F69),0)","v":0},{"$f":"LARGE($I$57:$I$156,ROWS($J$57:$J69))","v":0},13,""]
[null,null,null,null,null,14,{"$f":"INDEX(PORTFOLIO!$B$17:$B$215,$F70)","v":0},"",{"$f":"IF((G70<>\"total\")*(G70<>0),INDEX(PORTFOLIO!$H$17:$H$215,$F70),0)","v":0},{"$f":"LARGE($I$57:$I$156,ROWS($J$57:$J70))","v":0},13,""]
[null,null,null,null,null,15,{"$f":"INDEX(PORTFOLIO!$B$17:$B$215,$F71)","v":0},"",{"$f":"IF((G71<>\"total\")*(G71<>0),INDEX(PORTFOLIO!$H$17:$H$215,$F71),0)","v":0},{"$f":"LARGE($I$57:$I$156,ROWS($J$57:$J71))","v":0},13,""]
[null,null,null,null,null,16,{"$f":"INDEX(PORTFOLIO!$B$17:$B$215,$F72)","v":0},"",{"$f":"IF((G72<>\"total\")*(G72<>0),INDEX(PORTFOLIO!$H$17:$H$215,$F72),0)","v":0},{"$f":"LARGE($I$57:$I$156,ROWS($J$57:$J72))","v":0},13,""]
[null,null,null,null,null,17,{"$f":"INDEX(PORTFOLIO!$B$17:$B$215,$F73)","v":0},"",{"$f":"IF((G73<>\"total\")*(G73<>0),INDEX(PORTFOLIO!$H$17:$H$215,$F73),0)","v":0},{"$f":"LARGE($I$57:$I$156,ROWS($J$57:$J73))","v":0},13,""]
[null,null,null,null,null,18,{"$f":"INDEX(PORTFOLIO!$B$17:$B$215,$F74)","v":0},"",{"$f":"IF((G74<>\"total\")*(G74<>0),INDEX(PORTFOLIO!$H$17:$H$215,$F74),0)","v":0},{"$f":"LARGE($I$57:$I$156,ROWS($J$57:$J74))","v":0},13,""]
[null,null,null,null,null,19,{"$f":"INDEX(PORTFOLIO!$B$17:$B$215,$F75)","v":0},"",{"$f":"IF((G75<>\"total\")*(G75<>0),INDEX(PORTFOLIO!$H$17:$H$215,$F75),0)","v":0},{"$f":"LARGE($I$57:$I$156,ROWS($J$57:$J75))","v":0},13,""]
[null,null,null,null,null,20,{"$f":"INDEX(PORTFOLIO!$B$17:$B$215,$F76)","v":0},"",{"$f":"IF((G76<>\"total\")*(G76<>0),INDEX(PORTFOLIO!$H$17:$H$215,$F76),0)","v":0},{"$f":"LARGE($I$57:$I$156,ROWS($J$57:$J76))","v":0},13,""]
[null,null,null,null,null,21,{"$f":"INDEX(PORTFOLIO!$B$17:$B$215,$F77)","v":0},"",{"$f":"IF((G77<>\"total\")*(G77<>0),INDEX(PORTFOLIO!$H$17:$H$215,$F77),0)","v":0},{"$f":"LARGE($I$57:$I$156,ROWS($J$57:$J77))","v":0},13,""]
[null,null,null,null,null,22,{"$f":"INDEX(PORTFOLIO!$B$17:$B$215,$F78)","v":0},"",{"$f":"IF((G78<>\"total\")*(G78<>0),INDEX(PORTFOLIO!$H$17:$H$215,$F78),0)","v":0},{"$f":"LARGE($I$57:$I$156,ROWS($J$57:$J78))","v":0},13,""]
[null,null,null,null,null,23,{"$f":"INDEX(PORTFOLIO!$B$17:$B$215,$F79)","v":0},"",{"$f":"IF((G79<>\"total\")*(G79<>0),INDEX(PORTFOLIO!$H$17:$H$215,$F79),0)","v":0},{"$f":"LARGE($I$57:$I$156,ROWS($J$57:$J79))","v":0},13,""]
[null,null,null,null,null,24,{"$f":"INDEX(PORTFOLIO!$B$17:$B$215,$F80)","v":0},"",{"$f":"IF((G80<>\"total\")*(G80<>0),INDEX(PORTFOLIO!$H$17:$H$215,$F80),0)","v":0},{"$f":"LARGE($I$57:$I$156,ROWS($J$57:$J80))","v":0},13,""]
{"$rows_left_out":76}